Target
Deoxyuridine 5'-triphosphate nucleotidohydrolase, mitochondrial
Ligand
BDBM101781
Substrate
Meas. Tech.
Inhibition Assay
IC50
4e+1±n/a nM
Citation
 Fukuoka, MYokogawa, TMiyahara, SMiyakoshi, HYano, WTaguchi, JTakao, Y Uracil compound or salt thereof having human deoxyuridine triphosphatase inhibitory activity US Patent  US8530490 Publication Date 9/10/2013 
Target
Name:
Deoxyuridine 5'-triphosphate nucleotidohydrolase, mitochondrial
Synonyms:
DUT Deoxyuridine 5'-triphosphate nucleotidohydrolase (dUTPase) dUTP pyrophosphatase
Type:
Enzyme
Mol. Mass.:
26574.03
Organism:
Homo sapiens (Human)
Description:
P33316
Residue:
252
  
Inhibitor
Name:
BDBM101781
Synonyms:
US8530490, 41
Type:
Small organic molecule
Emp. Form.:
C22H31N3O6S
Mol. Mass.:
465.563
SMILES:
CC[C@@H](NS(=O)(=O)CCCOCn1ccc(=O)[nH]c1=O)c1cccc(OC2CCCC2)c1
: