Target
Deoxyuridine 5'-triphosphate nucleotidohydrolase, mitochondrial
Ligand
BDBM101784
Substrate
Meas. Tech.
Inhibition Assay
IC50
1.6e+2±n/a nM
Citation
 Fukuoka, MYokogawa, TMiyahara, SMiyakoshi, HYano, WTaguchi, JTakao, Y Uracil compound or salt thereof having human deoxyuridine triphosphatase inhibitory activity US Patent  US8530490 Publication Date 9/10/2013 
Target
Name:
Deoxyuridine 5'-triphosphate nucleotidohydrolase, mitochondrial
Synonyms:
DUT Deoxyuridine 5'-triphosphate nucleotidohydrolase (dUTPase) dUTP pyrophosphatase
Type:
Enzyme
Mol. Mass.:
26574.03
Organism:
Homo sapiens (Human)
Description:
P33316
Residue:
252
  
Inhibitor
Name:
BDBM101784
Synonyms:
US8530490, 44
Type:
Small organic molecule
Emp. Form.:
C20H26FN3O6S
Mol. Mass.:
455.5
SMILES:
Fc1ccc(CNS(=O)(=O)CCCOCn2ccc(=O)[nH]c2=O)cc1OC1CCCC1
: