Target
Deoxyuridine 5'-triphosphate nucleotidohydrolase, mitochondrial
Ligand
BDBM101788
Substrate
Meas. Tech.
Inhibition Assay
IC50
1.4e+2±n/a nM
Citation
 Fukuoka, MYokogawa, TMiyahara, SMiyakoshi, HYano, WTaguchi, JTakao, Y Uracil compound or salt thereof having human deoxyuridine triphosphatase inhibitory activity US Patent  US8530490 Publication Date 9/10/2013 
Target
Name:
Deoxyuridine 5'-triphosphate nucleotidohydrolase, mitochondrial
Synonyms:
DUT Deoxyuridine 5'-triphosphate nucleotidohydrolase (dUTPase) dUTP pyrophosphatase
Type:
Enzyme
Mol. Mass.:
26574.03
Organism:
Homo sapiens (Human)
Description:
P33316
Residue:
252
  
Inhibitor
Name:
BDBM101788
Synonyms:
US8530490, 48
Type:
Small organic molecule
Emp. Form.:
C21H28FN3O7S
Mol. Mass.:
485.526
SMILES:
C[C@@H](NS(=O)(=O)CCCOCn1ccc(=O)[nH]c1=O)c1ccc(F)c(OC2CCOCC2)c1
: