Target
Deoxyuridine 5'-triphosphate nucleotidohydrolase, mitochondrial
Ligand
BDBM101798
Substrate
Meas. Tech.
Inhibition Assay
IC50
3.1e+2±n/a nM
Citation
 Fukuoka, MYokogawa, TMiyahara, SMiyakoshi, HYano, WTaguchi, JTakao, Y Uracil compound or salt thereof having human deoxyuridine triphosphatase inhibitory activity US Patent  US8530490 Publication Date 9/10/2013 
Target
Name:
Deoxyuridine 5'-triphosphate nucleotidohydrolase, mitochondrial
Synonyms:
DUT Deoxyuridine 5'-triphosphate nucleotidohydrolase (dUTPase) dUTP pyrophosphatase
Type:
Enzyme
Mol. Mass.:
26574.03
Organism:
Homo sapiens (Human)
Description:
P33316
Residue:
252
  
Inhibitor
Name:
BDBM101798
Synonyms:
US8530490, 58
Type:
Small organic molecule
Emp. Form.:
C20H29N3O6S
Mol. Mass.:
439.526
SMILES:
CC(C)COc1cccc(c1)[C@@H](C)NS(=O)(=O)CCCOCn1ccc(=O)[nH]c1=O
: