Target
Deoxyuridine 5'-triphosphate nucleotidohydrolase, mitochondrial
Ligand
BDBM101842
Substrate
Meas. Tech.
Inhibition Assay
IC50
1.7e+2±n/a nM
Citation
 Fukuoka, MYokogawa, TMiyahara, SMiyakoshi, HYano, WTaguchi, JTakao, Y Uracil compound or salt thereof having human deoxyuridine triphosphatase inhibitory activity US Patent  US8530490 Publication Date 9/10/2013 
Target
Name:
Deoxyuridine 5'-triphosphate nucleotidohydrolase, mitochondrial
Synonyms:
DUT Deoxyuridine 5'-triphosphate nucleotidohydrolase (dUTPase) dUTP pyrophosphatase
Type:
Enzyme
Mol. Mass.:
26574.03
Organism:
Homo sapiens (Human)
Description:
P33316
Residue:
252
  
Inhibitor
Name:
BDBM101842
Synonyms:
CHEMBL2147986 | US8530490, 105
Type:
Small organic molecule
Emp. Form.:
C22H29N3O5S
Mol. Mass.:
447.548
SMILES:
C[C@@H](NS(=O)(=O)CC\C=C\Cn1ccc(=O)[nH]c1=O)c1cccc(OC2CCCC2)c1
: