Target
Deoxyuridine 5'-triphosphate nucleotidohydrolase, mitochondrial
Ligand
BDBM101847
Substrate
Meas. Tech.
Inhibition Assay
IC50
5e+1±n/a nM
Citation
 Fukuoka, MYokogawa, TMiyahara, SMiyakoshi, HYano, WTaguchi, JTakao, Y Uracil compound or salt thereof having human deoxyuridine triphosphatase inhibitory activity US Patent  US8530490 Publication Date 9/10/2013 
Target
Name:
Deoxyuridine 5'-triphosphate nucleotidohydrolase, mitochondrial
Synonyms:
DUT Deoxyuridine 5'-triphosphate nucleotidohydrolase (dUTPase) dUTP pyrophosphatase
Type:
Enzyme
Mol. Mass.:
26574.03
Organism:
Homo sapiens (Human)
Description:
P33316
Residue:
252
  
Inhibitor
Name:
BDBM101847
Synonyms:
CHEMBL2147985 | US8530490, 110
Type:
Small organic molecule
Emp. Form.:
C21H27N3O5S
Mol. Mass.:
433.521
SMILES:
C[C@@H](NS(=O)(=O)CC\C=C\Cn1ccc(=O)[nH]c1=O)c1cccc(OCC2CC2)c1
: