Target
Deoxyuridine 5'-triphosphate nucleotidohydrolase, mitochondrial
Ligand
BDBM101852
Substrate
Meas. Tech.
Inhibition Assay
IC50
2.5e+2±n/a nM
Citation
 Fukuoka, MYokogawa, TMiyahara, SMiyakoshi, HYano, WTaguchi, JTakao, Y Uracil compound or salt thereof having human deoxyuridine triphosphatase inhibitory activity US Patent  US8530490 Publication Date 9/10/2013 
Target
Name:
Deoxyuridine 5'-triphosphate nucleotidohydrolase, mitochondrial
Synonyms:
DUT Deoxyuridine 5'-triphosphate nucleotidohydrolase (dUTPase) dUTP pyrophosphatase
Type:
Enzyme
Mol. Mass.:
26574.03
Organism:
Homo sapiens (Human)
Description:
P33316
Residue:
252
  
Inhibitor
Name:
BDBM101852
Synonyms:
US8530490, 115
Type:
Small organic molecule
Emp. Form.:
C20H26FN3O5S
Mol. Mass.:
439.501
SMILES:
CC[C@@H](NS(=O)(=O)CCCn1ccc(=O)[nH]c1=O)c1ccc(F)c(OCC2CC2)c1
: