Target
Deoxyuridine 5'-triphosphate nucleotidohydrolase, mitochondrial
Ligand
BDBM101889
Substrate
Meas. Tech.
Inhibition Assay
IC50
2.6e+2±n/a nM
Citation
 Fukuoka, MYokogawa, TMiyahara, SMiyakoshi, HYano, WTaguchi, JTakao, Y Uracil compound or salt thereof having human deoxyuridine triphosphatase inhibitory activity US Patent  US8530490 Publication Date 9/10/2013 
Target
Name:
Deoxyuridine 5'-triphosphate nucleotidohydrolase, mitochondrial
Synonyms:
DUT Deoxyuridine 5'-triphosphate nucleotidohydrolase (dUTPase) dUTP pyrophosphatase
Type:
Enzyme
Mol. Mass.:
26574.03
Organism:
Homo sapiens (Human)
Description:
P33316
Residue:
252
  
Inhibitor
Name:
BDBM101889
Synonyms:
CHEMBL2057599 | US8530490, 159
Type:
Small organic molecule
Emp. Form.:
C21H29N3O6S
Mol. Mass.:
451.536
SMILES:
CC(C)(CCCOCn1ccc(=O)[nH]c1=O)NS(=O)(=O)c1cccc(OCC2CC2)c1
: