Target
Protein kinase C epsilon type
Ligand
BDBM50258529
Substrate
Kd
0.24±0.01 nM
Citation
 Kedei, NLewin, NEGéczy, TGéczy, JBraun, DCChen, JHerrmann, MAHeldman, MRLim, LMannan, PGarfield, SHPoudel, YBCummins, TJRudra, ABlumberg, PMKeck, GE Biological profile of the less lipophilic and synthetically more accessible bryostatin 7 closely resembles that of bryostatin 1. ACS Chem Biol 8:767-77 (2013)  
Target
Name:
Protein kinase C epsilon type
Synonyms:
KPCE_HUMAN PKCE Protein kinase C epsilon Protein kinase C, PKC; classical/novel nPKC-epsilon
Type:
Enzyme
Mol. Mass.:
83680.45
Organism:
Homo sapiens (Human)
Description:
The recombinant human PKC enzymes were produced using a baculovirus expression system in SF9 cells
Residue:
737
  
Inhibitor
Name:
BDBM50258529
Synonyms:
CHEMBL449158 | bryostatin 1
Type:
Small organic molecule
Emp. Form.:
C47H68O17
Mol. Mass.:
905.0326
SMILES:
CCC\C=C\C=C\C(=O)O[C@H]1\C(C[C@H]2C[C@@H](OC(=O)C[C@H](O)C[C@@H]3C[C@H](OC(C)=O)C(C)(C)[C@](O)(C[C@@H]4C\C(C[C@@H](O4)\C=C\C(C)(C)[C@]1(O)O2)=C\C(=O)OC)O3)[C@@H](C)O)=C\C(=O)OC
: