Target
RAC-alpha serine/threonine-protein kinase
Ligand
BDBM103119
Substrate
Meas. Tech.
Biochemical Assay
IC50
2.0e+2±n/a nM
Citation
 Ali, SMAshwell, MAKelleher, EKoerner, SLapierre, JLink, JSLiu, YMoussa, MPalma, RTandon, MVensel, DWestlund, NWu, HYang, R Substituted benzo-pyrido-triazolo-diazepine compounds US Patent  US8541407 Publication Date 9/24/2013 
Target
Name:
RAC-alpha serine/threonine-protein kinase
Synonyms:
AKT phosphorylation (p-AKT) AKT1/PPP1CA C-AKT PKB alpha Protein kinase B Protein kinase B (Akt 1) Protein kinase B alpha Proto-oncogene Akt (Akt1) Proto-oncogene c-Akt (AKT1) RAC-PK-alpha RAC-alpha serine/threonine-protein kinase (AKT1) | RAC-alpha serine/threonine-protein kinase (pAKT)
Type:
Enzyme
Mol. Mass.:
55681.25
Organism:
Homo sapiens (Human)
Description:
P31749
Residue:
480
  
Inhibitor
Name:
BDBM103119
Synonyms:
US8541407, 96
Type:
Small organic molecule
Emp. Form.:
C26H19N7O
Mol. Mass.:
445.4754
SMILES:
O=C(NCc1ccc(cc1)-c1nnc2-c3ccccc3Nc3ncccc3-n12)c1cccnc1
: