Target
Kinesin-like protein KIF11
Ligand
BDBM103307
Substrate
Meas. Tech.
In Vitro Assay
pH
7.5±0
Temperature
310.15±0 K
IC50
0.60±0.0 nM
Citation
 Abrams, TBarsanti, PDing, YDuhl, DHan, WHu, CPan, Y Triazole compounds as KSP inhibitors US Patent  US8546434 Publication Date 10/1/2013 
Target
Name:
Kinesin-like protein KIF11
Synonyms:
EG5 KIF11_HUMAN Kinesin Spindle Protein Eg5 TRIP5 | kinesin spindle protein
Type:
PROTEIN
Mol. Mass.:
119138.97
Organism:
Homo sapiens (Human)
Description:
ChEMBL_1457426
Residue:
1056
  
Inhibitor
Name:
BDBM103307
Synonyms:
US8546434, 4
Type:
Small organic molecule
Emp. Form.:
C28H34F3N5O2
Mol. Mass.:
529.5971
SMILES:
C[C@H](O)C(=O)N(C[C@@H]1CNC[C@@H]1F)[C@@H](c1nc(nn1Cc1ccccc1)-c1cc(F)ccc1F)C(C)(C)C
: