Target
17-beta-hydroxysteroid dehydrogenase type 2
Ligand
BDBM103334
Substrate
Meas. Tech.
Radioactivity Assay
IC50
5641±0.0 nM
Citation
 Hartmann, RFrotscher, MOberwinkler, SZiegler, EMessinger, JThole, H 17Beta-hydroxysteroid dehydrogenase type 1 inhibitors for the treatment of hormone-related diseases US Patent  US8546392 Publication Date 10/1/2013 
Target
Name:
17-beta-hydroxysteroid dehydrogenase type 2
Synonyms:
17-beta-Hydroxysteroid Dehydrogenase 2 (17-beta-HSD2) 20-alpha-HSD EDH17B2 Estradiol 17-beta-dehydrogenase 2 (17beta-HSD2) Microsomal 17-beta-hydroxysteroid dehydrogenas Testosterone 17-beta-dehydrogenase
Type:
Oxidoreductase; single-pass type II membrane protein
Mol. Mass.:
42795.29
Organism:
Homo sapiens (Human)
Description:
Enzyme was partially purified from human placenta.
Residue:
387
  
Inhibitor
Name:
BDBM103334
Synonyms:
US8546392, 19
Type:
Small organic molecule
Emp. Form.:
C23H22O4
Mol. Mass.:
362.4184
SMILES:
CCOC(=O)\C=C\c1c(OC)ccc2cc(ccc12)-c1cccc(OC)c1
: