Target
Cytochrome P450 2D6
Ligand
BDBM103334
Substrate
Meas. Tech.
Inhibition Assay
IC50
3.256e+4± 7.2e+2 nM
Citation
 Hartmann, RFrotscher, MOberwinkler, SZiegler, EMessinger, JThole, H 17Beta-hydroxysteroid dehydrogenase type 1 inhibitors for the treatment of hormone-related diseases US Patent  US8546392 Publication Date 10/1/2013 
Target
Name:
Cytochrome P450 2D6
Synonyms:
CP2D6_HUMAN CYP2DL1 Cytochrome P450 2D6 (CYP2D6) P450-DB1
Type:
Protein
Mol. Mass.:
55774.82
Organism:
Homo sapiens (Human)
Description:
P10635
Residue:
497
  
Inhibitor
Name:
BDBM103334
Synonyms:
US8546392, 19
Type:
Small organic molecule
Emp. Form.:
C23H22O4
Mol. Mass.:
362.4184
SMILES:
CCOC(=O)\C=C\c1c(OC)ccc2cc(ccc12)-c1cccc(OC)c1
: