Target
Histone deacetylase 1
Ligand
BDBM50248476
Substrate
Meas. Tech.
Enzyme Assay
IC50
52±n/a nM
Citation
 Chen, DSong, HYSun, ETYu, NZou, Y Benzimidazole derivatives: preparation and pharmaceutical applications US Patent  US8551988 Publication Date 10/8/2013 
Target
Name:
Histone deacetylase 1
Synonyms:
Cereblon/Histone deacetylase 1 HDAC1 Histone deacetylase 1 (HDAC1) RPD3L1
Type:
Enzyme
Mol. Mass.:
55090.27
Organism:
Homo sapiens (Human)
Description:
Q13547
Residue:
482
  
Inhibitor
Name:
BDBM50248476
Synonyms:
CHEMBL491316 N-hydroxy-3-[2-phenethyl-1-(2-pyrrolidin-1-ylethyl)-1H-benzimidazol-5-yl]acrylamide US10201527, Compound 72 US8551988, 72
Type:
Small organic molecule
Emp. Form.:
C24H28N4O2
Mol. Mass.:
404.5047
SMILES:
ONC(=O)\C=C\c1ccc2n(CCN3CCCC3)c(CCc3ccccc3)nc2c1
: