Target
Tyrosine-protein kinase JAK3
Ligand
BDBM103727
Substrate
Meas. Tech.
Inhibition Assay
IC50
187.3±0.0 nM
Citation
 Menet, CJSmits, KK Compound useful for the treatment of degenerative and inflammatory diseases US Patent  US8563545 Publication Date 10/22/2013 
Target
Name:
Tyrosine-protein kinase JAK3
Synonyms:
JAK-3 JAK3_HUMAN Janus kinase 3 (JAK3) L-JAK | Leukocyte janus kinase
Type:
Protein
Mol. Mass.:
125111.08
Organism:
Homo sapiens (Human)
Description:
P52333
Residue:
1124
  
Inhibitor
Name:
BDBM103727
Synonyms:
US10112907, Example 00033 US10708263, Compound 1 US10919890, Compound 1 US11000528, Cpd # 1 US11279699, Compound Filgotinib | US8563545, 1
Type:
Small organic molecule
Emp. Form.:
C21H23N5O3S
Mol. Mass.:
425.504
SMILES:
O=C(Nc1nc2cccc(-c3ccc(CN4CCS(=O)(=O)CC4)cc3)n2n1)C1CC1
: