Target
Mitogen-activated protein kinase 8
Ligand
BDBM103910
Substrate
IC50
154.5±37.1 nM
Citation
 Feng, YChambers, JWIqbal, SKoenig, MPark, HCherry, LHernandez, PFiguera-Losada, MLoGrasso, PV A small molecule bidentate-binding dual inhibitor probe of the LRRK2 and JNK kinases. ACS Chem Biol 8:1747-54 (2013)  
Target
Name:
Mitogen-activated protein kinase 8
Synonyms:
JNK-46 JNK1-alpha-1 MK08_HUMAN PRKM8 SAPK1C c-Jun N-terminal kinase 1 c-Jun N-terminal kinase 1(JNK1) | c-Jun N-terminal kinase 2 (JNK2)
Type:
Enzyme
Mol. Mass.:
48297.57
Organism:
Homo sapiens (Human)
Description:
JNK-1 was purchased from Upstate Cell Signaling Solutions (formerly Upstate Biotechnology).
Residue:
427
  
Inhibitor
Name:
BDBM103910
Synonyms:
JNK3 inhibitor 7 | US8562945, 243
Type:
Small organic molecule
Emp. Form.:
C18H24N6O2ReS
Mol. Mass.:
574.694
SMILES:
CN1C=C[N]2=C1C[N]1(CCc3ccc(SOON)cc3)CC3=[N](C=CN3C)[Re+]21
: