Target
Gag-Pol polyprotein [484-582,I494L,I497V,V499I,D514N,E519D,R541K,D544E,Q553K,N572D,L573M]
Ligand
BDBM104103
Substrate
Meas. Tech.
Inhibition Assay
Ki
0.383±0.097 nM
Citation
 Shen, YAltman, MDAli, ANalam, MNCao, HRana, TMSchiffer, CATidor, B Testing the substrate-envelope hypothesis with designed pairs of compounds. ACS Chem Biol 8:2433-41 (2013)  
Target
Name:
Gag-Pol polyprotein [484-582,I494L,I497V,V499I,D514N,E519D,R541K,D544E,Q553K,N572D,L573M]
Synonyms:
HIV-1 protease M2 POL_HV196 | gag-pol
Type:
Protein
Mol. Mass.:
10757.68
Organism:
Human immunodeficiency virus
Description:
Q9QBY3[484-582,I494L,I497V,V499I,D514N,E519D,R541K,D544E,Q553K,N572D,L573M]
Residue:
99
  
Inhibitor
Name:
BDBM104103
Synonyms:
N-[(1S,2R)-3-[(6-Benzothiazolylsulfonyl)(cyclohexylmethyl)amino]-2-hydroxy-1- (phenylmethyl)propyl]-3-hydroxy-benzamide (AF-72)
Type:
Small organic molecule
Emp. Form.:
C31H35N3O5S2
Mol. Mass.:
593.757
SMILES:
O[C@H](CN(CC1CCCCC1)S(=O)(=O)c1ccc2ncsc2c1)[C@H](Cc1ccccc1)NC(=O)c1cccc(O)c1
: