Target
Gag-Pol polyprotein [484-582,I494L,I497V,V499I,D514N,E519D,R541K,D544E,Q553K,N572D,L573M]
Ligand
BDBM104110
Substrate
Meas. Tech.
Inhibition Assay
Ki
1.261±0.176 nM
Citation
 Shen, YAltman, MDAli, ANalam, MNCao, HRana, TMSchiffer, CATidor, B Testing the substrate-envelope hypothesis with designed pairs of compounds. ACS Chem Biol 8:2433-41 (2013)  
Target
Name:
Gag-Pol polyprotein [484-582,I494L,I497V,V499I,D514N,E519D,R541K,D544E,Q553K,N572D,L573M]
Synonyms:
HIV-1 protease M2 POL_HV196 | gag-pol
Type:
Protein
Mol. Mass.:
10757.68
Organism:
Human immunodeficiency virus
Description:
Q9QBY3[484-582,I494L,I497V,V499I,D514N,E519D,R541K,D544E,Q553K,N572D,L573M]
Residue:
99
  
Inhibitor
Name:
BDBM104110
Synonyms:
3-Hydroxy-N-[(1S,2R)-2-hydroxy-3-[[[5-(5-isoxazolyl)-2-thienyl]sulfonyl](2- methylbutyl)amino]-1-(phenylmethyl)propyl]-benzamide (AF-80)
Type:
Small organic molecule
Emp. Form.:
C28H31N3O6S2
Mol. Mass.:
569.692
SMILES:
CC(C)CN(C[C@@H](O)[C@H](Cc1ccccc1)NC(=O)c1cccc(O)c1)S(=O)(=O)c1ccc(s1)-c1ccno1
: