Target
Gag-Pol polyprotein [484-582,I494L,I497V,V499I,E519D,I534V,R541K,D544E,Q553K,A555V,L573M]
Ligand
BDBM104104
Substrate
Meas. Tech.
Inhibition Assay
Ki
2.265±0.643 nM
Citation
 Shen, YAltman, MDAli, ANalam, MNCao, HRana, TMSchiffer, CATidor, B Testing the substrate-envelope hypothesis with designed pairs of compounds. ACS Chem Biol 8:2433-41 (2013)  
Target
Name:
Gag-Pol polyprotein [484-582,I494L,I497V,V499I,E519D,I534V,R541K,D544E,Q553K,A555V,L573M]
Synonyms:
HIV-1 protease M4 POL_HV196 | gag-pol
Type:
Protein
Mol. Mass.:
10771.71
Organism:
Human immunodeficiency virus
Description:
Q9QBY3[484-582,I494L,I497V,V499I,E519D,I534V,R541K,D544E,Q553K,A555V,L573M]
Residue:
99
  
Inhibitor
Name:
BDBM104104
Synonyms:
N-[(1S,2R)-3-[(6-Benzothiazolylsulfonyl)(3-phenylpropyl)amino]-2-hydroxy-1- (phenylmethyl)propyl]-3-hydroxy-benzamide (AF-69)
Type:
Small organic molecule
Emp. Form.:
C33H33N3O5S2
Mol. Mass.:
615.762
SMILES:
O[C@H](CN(CCCc1ccccc1)S(=O)(=O)c1ccc2ncsc2c1)[C@H](Cc1ccccc1)NC(=O)c1cccc(O)c1
: