Target
Orexin/Hypocretin receptor type 1
Ligand
BDBM104688
Substrate
Meas. Tech.
Radioligand Binding Assay
Ki
96±0.0 nM
Citation
 Breslin, MJColeman, PJCox, CDSchreier, JD Pyridyl piperidine orexin receptor antagonists US Patent  US8569311 Publication Date 10/29/2013 
Target
Name:
Orexin/Hypocretin receptor type 1
Synonyms:
Hcrtr1 OX1R_RAT Orexin receptor type 1 (OX1R) Ox1-R | Ox1R
Type:
Protein
Mol. Mass.:
46817.55
Organism:
Rattus norvegicus (Rat)
Description:
P56718
Residue:
416
  
Inhibitor
Name:
BDBM104688
Synonyms:
US8569311, 2-1
Type:
Small organic molecule
Emp. Form.:
C21H22FN5O2
Mol. Mass.:
395.4301
SMILES:
Cc1ccc(c(c1)C(=O)N1CCCC(COc2ccc(F)nc2)C1)-n1nccn1
: