Target
cAMP and cAMP-inhibited cGMP 3',5'-cyclic phosphodiesterase 10A
Ligand
BDBM107112
Substrate
Meas. Tech.
Inhibition Assay
IC50
1.79±0.0 nM
Citation
 Chaturvedula, PVKimura, SR Inhibitors of PDE10 US Patent  US8592423 Publication Date 11/26/2013 
Target
Name:
cAMP and cAMP-inhibited cGMP 3',5'-cyclic phosphodiesterase 10A
Synonyms:
3',5'-cyclic phosphodiesterase PDE10A Phosphodiesterase 10 (PDE10) | Phosphodiesterase 10A
Type:
Protein
Mol. Mass.:
88412.52
Organism:
Homo sapiens (Human)
Description:
Q9Y233
Residue:
1055
  
Inhibitor
Name:
BDBM107112
Synonyms:
US8592423, 2-(2-(1-Ethyl-4-phenyl-1H-imidazol-2-yl)cyclopropyl)-5,8-dimethyl-[1,2,4]triazolo[1,5-a]pyrazine
Type:
Small organic molecule
Emp. Form.:
C21H22N6
Mol. Mass.:
358.4396
SMILES:
CCn1cc(nc1C1CC1c1nc2c(C)ncc(C)n2n1)-c1ccccc1
: