Target
cAMP and cAMP-inhibited cGMP 3',5'-cyclic phosphodiesterase 10A
Ligand
BDBM107115
Substrate
Meas. Tech.
Inhibition Assay
IC50
14.52±0.0 nM
Citation
 Chaturvedula, PVKimura, SR Inhibitors of PDE10 US Patent  US8592423 Publication Date 11/26/2013 
Target
Name:
cAMP and cAMP-inhibited cGMP 3',5'-cyclic phosphodiesterase 10A
Synonyms:
3',5'-cyclic phosphodiesterase PDE10A Phosphodiesterase 10 (PDE10) | Phosphodiesterase 10A
Type:
Protein
Mol. Mass.:
88412.52
Organism:
Homo sapiens (Human)
Description:
Q9Y233
Residue:
1055
  
Inhibitor
Name:
BDBM107115
Synonyms:
US8592423, 5,7-Dimethyl-2-(2-(1-methyl-4-phenyl-1H-imidazol-2-yl)cyclopropyl)-[1,2,4]-triazolo[1,5-a]pyrimidine
Type:
Small organic molecule
Emp. Form.:
C20H20N6
Mol. Mass.:
344.413
SMILES:
Cc1cc(C)n2nc(nc2n1)C1CC1c1nc(cn1C)-c1ccccc1
: