Target
cAMP and cAMP-inhibited cGMP 3',5'-cyclic phosphodiesterase 10A
Ligand
BDBM107116
Substrate
Meas. Tech.
Inhibition Assay
IC50
6.65±0.0 nM
Citation
 Chaturvedula, PVKimura, SR Inhibitors of PDE10 US Patent  US8592423 Publication Date 11/26/2013 
Target
Name:
cAMP and cAMP-inhibited cGMP 3',5'-cyclic phosphodiesterase 10A
Synonyms:
3',5'-cyclic phosphodiesterase PDE10A Phosphodiesterase 10 (PDE10) | Phosphodiesterase 10A
Type:
Protein
Mol. Mass.:
88412.52
Organism:
Homo sapiens (Human)
Description:
Q9Y233
Residue:
1055
  
Inhibitor
Name:
BDBM107116
Synonyms:
US8592423, 5,8-Dimethyl-2-(2-(4-phenyl-1-propyl-1H-imidazol-2-Acyclopropyl)-[1,2,4]triazolo[1,5-a]pyrazine
Type:
Small organic molecule
Emp. Form.:
C22H24N6
Mol. Mass.:
372.4662
SMILES:
CCCn1cc(nc1C1CC1c1nc2c(C)ncc(C)n2n1)-c1ccccc1
: