Target
Hepatocyte growth factor receptor
Ligand
BDBM109205
Substrate
Meas. Tech.
Tyrosine Kinase Activity Assay
pH
7±0
Temperature
305.15±0 K
IC50
2.6e+2±n/a nM
Citation
 Michels, MBriem, HVakalopoulos, AZimmermann, KTeusch, N Furopyridinyl-substituted 1,4-dihydropyridine derivatives and methods of use thereof US Patent  US8604028 Publication Date 12/10/2013 
Target
Name:
Hepatocyte growth factor receptor
Synonyms:
Hepatocyte growth factor receptor Hepatocyte growth factor receptor (c-MET) MET Met proto-oncogene (hepatocyte growth factor receptor) Tyrosine-protein kinase Met (c-Met) c-Met kinase
Type:
Protein
Mol. Mass.:
155559.73
Organism:
Homo sapiens (Human)
Description:
P08581
Residue:
1390
  
Inhibitor
Name:
BDBM109205
Synonyms:
US8604028, 72
Type:
Small organic molecule
Emp. Form.:
C21H13ClN4O3
Mol. Mass.:
404.806
SMILES:
Nc1nccc2oc(cc12)[C@@H]1C2C(=O)OCC2=NC(=C1[N+]#[C-])c1ccc(Cl)cc1
: