Target
Apoptosis regulator Bcl-2
Ligand
BDBM109236
Substrate
Meas. Tech.
SPR Directy Binding Assay (Biacore 4000)
pH
7.4±n/a
IC50
>12000±0 nM
Kd
>750±0.0 nM
Comments
extracted
Citation
 Lessene, GCzabotar, PESleebs, BEZobel, KLowes, KNAdams, JMBaell, JBColman, PMDeshayes, KFairbrother, WJFlygare, JAGibbons, PKersten, WJKulasegaram, SMoss, RMParisot, JPSmith, BJStreet, IPYang, HHuang, DCWatson, KG Structure-guided design of a selective BCL-X(L) inhibitor. Nat Chem Biol 9:390-7 (2013)  
Target
Name:
Apoptosis regulator Bcl-2
Synonyms:
Apoptosis regulator Bcl-2 Protein BCL-2 BCL2_HUMAN | Bcl-2 Protein
Type:
Homodimer or heterodimer
Mol. Mass.:
26269.11
Organism:
Homo sapiens (Human)
Description:
P10415
Residue:
239
  
Inhibitor
Name:
BDBM109236
Synonyms:
WEHI-539
Type:
Small organic molecule
Emp. Form.:
C31H29N5O3S2
Mol. Mass.:
583.724
SMILES:
NCc1ccc(OCCCc2sc(nc2C(O)=O)-c2ccc3CCCC(=NNc4nc5ccccc5s4)c3c2)cc1
: