Target
Carboxypeptidase B2
Ligand
BDBM109254
Substrate
Meas. Tech.
Enzyme Inhibition Assay
IC50
7.0±n/a nM
Citation
 Nagata, TInoue, MAshida, YNoguchi, KOno, M Cycloalkyl-substituted imidazole derivative US Patent  US8609710 Publication Date 12/17/2013 
Target
Name:
Carboxypeptidase B2
Synonyms:
CBPB2_HUMAN CPU Carboxypeptidase B2 isoform A Plasma carboxypeptidase B Thrombin-activable fibrinolysis inhibitor | pCPB
Type:
Enzyme
Mol. Mass.:
48432.74
Organism:
Homo sapiens (Human)
Description:
Q96IY4
Residue:
423
  
Inhibitor
Name:
BDBM109254
Synonyms:
US8609710, 25
Type:
Small organic molecule
Emp. Form.:
C16H27N3O3
Mol. Mass.:
309.4039
SMILES:
C[C@H](CN)OC(Cc1cn(cn1)[C@H]1CC[C@H](C)CC1)C(O)=O
: