Target
Carboxypeptidase B2
Ligand
BDBM109256
Substrate
Meas. Tech.
Enzyme Inhibition Assay
IC50
7.5±n/a nM
Citation
 Nagata, TInoue, MAshida, YNoguchi, KOno, M Cycloalkyl-substituted imidazole derivative US Patent  US8609710 Publication Date 12/17/2013 
Target
Name:
Carboxypeptidase B2
Synonyms:
CBPB2_HUMAN CPU Carboxypeptidase B2 isoform A Plasma carboxypeptidase B Thrombin-activable fibrinolysis inhibitor | pCPB
Type:
Enzyme
Mol. Mass.:
48432.74
Organism:
Homo sapiens (Human)
Description:
Q96IY4
Residue:
423
  
Inhibitor
Name:
BDBM109256
Synonyms:
US8609710, 33
Type:
Small organic molecule
Emp. Form.:
C17H29N3O2
Mol. Mass.:
307.4311
SMILES:
CC1(C)CCCC(C1)n1cnc(CC(CCCN)C(O)=O)c1
: