Target
Enteropeptidase
Ligand
BDBM109675
Substrate
Meas. Tech.
Inhibition Assay
Ki
0.31±0.0 nM
Citation
 Konishi, ATokumasu, MSuzuki, TKoshiba, TOhsumi, KIkehara, OKodama, Y Heteroarylcarboxylic acid ester derivative US Patent  US8609715 Publication Date 12/17/2013 
Target
Name:
Enteropeptidase
Synonyms:
ENTK PRSS7 | TMPRSS15
Type:
Enzyme
Mol. Mass.:
112901.62
Organism:
Homo sapiens (Human)
Description:
P98073
Residue:
1019
  
Inhibitor
Name:
BDBM109675
Synonyms:
US8609715, B-32
Type:
Small organic molecule
Emp. Form.:
C19H18FN3O7S
Mol. Mass.:
451.426
SMILES:
NC(=N)c1ccc(OC(=O)c2ccc(CCC(=O)N[C@@H](CC(O)=O)C(O)=O)s2)c(F)c1
: