Target
Calpain-2 catalytic subunit
Ligand
BDBM110197
Substrate
Meas. Tech.
m-Calpain Inhibition Assay
pH
7.5±n/a
Temperature
298.15±n/a K
IC50
>1.00e+5±n/a nM
Comments
extracted
Citation
 Baek, KHKarki, RLee, ESNa, YKwon, Y Synthesis and investigation of dihydroxychalcones as calpain and cathepsin inhibitors. Bioorg Chem 51:24-30 (2013)  
Target
Name:
Calpain-2 catalytic subunit
Synonyms:
CAN2_HUMAN CANPL2 Calcium-activated neutral proteinase 2 Calpain M-type Calpain-2 (m-Calpain) Calpain-2 large subunit M-calpain calpain
Type:
Protein
Mol. Mass.:
79965.18
Organism:
Homo sapiens (Human)
Description:
Residue:
700
  
Inhibitor
Name:
BDBM110197
Synonyms:
1-(3,5-Dihydroxyphenyl)-3-(furan-3-yl)propenone (24)
Type:
Small organic molecule
Emp. Form.:
C13H10O4
Mol. Mass.:
230.2161
SMILES:
Oc1cc(O)cc(c1)C(=O)\C=C\c1ccoc1
: