Target
Ribonuclease pancreatic
Ligand
BDBM111444
Substrate
Ki
8.0e+4± 3e+3 nM
Citation
 Debnath, JDasgupta, SPathak, T Amino and carboxy functionalized modified nucleosides: a potential class of inhibitors for angiogenin. Bioorg Chem 52:56-61 (2014)  
Target
Name:
Ribonuclease pancreatic
Synonyms:
RIB1 RNASE1 RNS1 Ribonuclease pancreatic
Type:
Protein
Mol. Mass.:
17653.66
Organism:
Homo sapiens (Human)
Description:
Residue:
156
  
Inhibitor
Name:
BDBM111444
Synonyms:
Ser-aT (Compound 2)
Type:
Small organic moleucle
Emp. Form.:
C13H20N4O6
Mol. Mass.:
328.3211
SMILES:
Cc1cn([C@H]2C[C@@H](NC(=O)C(N)CO)[C@@H](CO)O2)c(=O)[nH]c1=O
: