Target
Prostaglandin D2 receptor 2
Ligand
BDBM111606
Substrate
Meas. Tech.
Receptor Binding Assay
Ki
5.6±n/a nM
IC50
2.2±n/a nM
Citation
 Kugimiya, ATachibana, Y Indolecarboxylic acid derivative having PGD2 receptor antagonistic activity US Patent  US8623903 Publication Date 1/7/2014 
Target
Name:
Prostaglandin D2 receptor 2
Synonyms:
CD_antigen=CD294 Chemoattractant Receptor-homologous molecule expressed on T-helper type 2 cells (CRTH2) Chemoattractant receptor-homologous molecule expressed on Th2 cells (CRTH2) G protein-coupled receptor 44 GPR44 PTGDR2 Prostaglandin D2 receptor 2 | Prostaglandin D2 receptor 2 (PGD2)
Type:
Enzyme
Mol. Mass.:
43295.45
Organism:
Homo sapiens (Human)
Description:
Q9Y5Y4
Residue:
395
  
Inhibitor
Name:
BDBM111606
Synonyms:
US8623903, I-14
Type:
Small organic molecule
Emp. Form.:
C23H27FN2O3S
Mol. Mass.:
430.535
SMILES:
CC(C)Oc1ccc(cc1)S(=O)(=O)N1CCC(CC1)n1cc(C)c2cc(F)ccc12
: