Target
Tyrosine-protein kinase BTK
Ligand
BDBM111945
Substrate
Meas. Tech.
Biochemical Assay
pH
7.5±0
IC50
5±0 nM
Citation
 Barbosa, AJBlomgren, PACurrie, KSKrishnamoorthy, RKropf, JELee, SHMitchell, SAOrtwine, DSchmitt, ACWang, XXu, JYoung, WZhang, HZhao, ZZhichkin, PE Pyridone and aza-pyridone compounds and methods of use US Patent  US8618107 Publication Date 12/31/2013 
Target
Name:
Tyrosine-protein kinase BTK
Synonyms:
AGMX1 Agammaglobulinaemia tyrosine kinase B cell progenitor kinase BPK BTK_HUMAN Tyrosine Kinase BTK Tyrosine-protein kinase BTK (BTK)
Type:
Enzyme
Mol. Mass.:
76289.95
Organism:
Homo sapiens (Human)
Description:
Q06187
Residue:
659
  
Inhibitor
Name:
BDBM111945
Synonyms:
US8618107, 113
Type:
Small organic molecule
Emp. Form.:
C34H39N7O3
Mol. Mass.:
593.7186
SMILES:
CN1CCN(CC1)c1ccc(Nc2cc(cn(C)c2=O)-c2cccc(N3CCn4c5CCCCc5cc4C3=O)c2CO)nc1
: