Target
Tyrosine-protein kinase BTK
Ligand
BDBM111950
Substrate
Meas. Tech.
Biochemical Assay
pH
7.5±0
IC50
5±0 nM
Citation
 Barbosa, AJBlomgren, PACurrie, KSKrishnamoorthy, RKropf, JELee, SHMitchell, SAOrtwine, DSchmitt, ACWang, XXu, JYoung, WZhang, HZhao, ZZhichkin, PE Pyridone and aza-pyridone compounds and methods of use US Patent  US8618107 Publication Date 12/31/2013 
Target
Name:
Tyrosine-protein kinase BTK
Synonyms:
AGMX1 Agammaglobulinaemia tyrosine kinase B cell progenitor kinase BPK BTK_HUMAN Tyrosine Kinase BTK Tyrosine-protein kinase BTK (BTK)
Type:
Enzyme
Mol. Mass.:
76289.95
Organism:
Homo sapiens (Human)
Description:
Q06187
Residue:
659
  
Inhibitor
Name:
BDBM111950
Synonyms:
US8618107, 149
Type:
Small organic molecule
Emp. Form.:
C30H31FN6O4
Mol. Mass.:
558.6033
SMILES:
Cn1cc(cc(Nc2cc3COCCn3n2)c1=O)-c1cc(F)cc(N2CCn3c4CCCCc4cc3C2=O)c1CO
: