Target
Tyrosine-protein kinase BTK
Ligand
BDBM111972
Substrate
Meas. Tech.
Biochemical Assay
pH
7.5±0
IC50
2.8±0 nM
Citation
 Barbosa, AJBlomgren, PACurrie, KSKrishnamoorthy, RKropf, JELee, SHMitchell, SAOrtwine, DSchmitt, ACWang, XXu, JYoung, WZhang, HZhao, ZZhichkin, PE Pyridone and aza-pyridone compounds and methods of use US Patent  US8618107 Publication Date 12/31/2013 
Target
Name:
Tyrosine-protein kinase BTK
Synonyms:
AGMX1 Agammaglobulinaemia tyrosine kinase B cell progenitor kinase BPK BTK_HUMAN Tyrosine Kinase BTK Tyrosine-protein kinase BTK (BTK)
Type:
Enzyme
Mol. Mass.:
76289.95
Organism:
Homo sapiens (Human)
Description:
Q06187
Residue:
659
  
Inhibitor
Name:
BDBM111972
Synonyms:
US8618107, 284
Type:
Small organic molecule
Emp. Form.:
C35H39FN6O3
Mol. Mass.:
610.721
SMILES:
CCN1CCc2nc(Nc3cc(cn(C)c3=O)-c3cc(F)cc(N4CCn5c6CC(C)(C)Cc6cc5C4=O)c3CO)ccc2C1
: