Target
Tyrosine-protein kinase BTK
Ligand
BDBM111994
Substrate
Meas. Tech.
Biochemical Assay
pH
7.5±0
IC50
3.3±0 nM
Citation
 Barbosa, AJBlomgren, PACurrie, KSKrishnamoorthy, RKropf, JELee, SHMitchell, SAOrtwine, DSchmitt, ACWang, XXu, JYoung, WZhang, HZhao, ZZhichkin, PE Pyridone and aza-pyridone compounds and methods of use US Patent  US8618107 Publication Date 12/31/2013 
Target
Name:
Tyrosine-protein kinase BTK
Synonyms:
AGMX1 Agammaglobulinaemia tyrosine kinase B cell progenitor kinase BPK BTK_HUMAN Tyrosine Kinase BTK Tyrosine-protein kinase BTK (BTK)
Type:
Enzyme
Mol. Mass.:
76289.95
Organism:
Homo sapiens (Human)
Description:
Q06187
Residue:
659
  
Inhibitor
Name:
BDBM111994
Synonyms:
US8618107, 308
Type:
Small organic molecule
Emp. Form.:
C34H36FN5O3S
Mol. Mass.:
613.745
SMILES:
CN1CCC(C1)c1ccc(Nc2cc(cn(C)c2=O)-c2cc(F)cc(N3CCc4c5CCCCc5sc4C3=O)c2CO)nc1
: