Target
Histone deacetylase 6
Ligand
BDBM249365
Substrate
Meas. Tech.
HDAC Enzyme Assay
pH
7.4±n/a
Temperature
298.15±n/a K
IC50
2.40±n/a nM
Comments
extracted
Citation
 Mazitschek, Rvan Duzer, JH Pyrimidine hydroxy amide compounds as HDAC6 selective inhibitors US Patent  US9884850 Publication Date 2/6/2018 
Target
Name:
Histone deacetylase 6
Synonyms:
Cereblon/Histone deacetylase 6 HDAC6 Histone deacetylase 6 (HDAC6) KIAA0901 | ORF Names:JM21
Type:
Chromatin regulator; hydrolase; repressor
Mol. Mass.:
131381.51
Organism:
Homo sapiens (Human)
Description:
Q9UBN7
Residue:
1215
  
Inhibitor
Name:
BDBM249365
Synonyms:
US9464073, 002 | US9884850, Compound 2
Type:
Small organic molecule
Emp. Form.:
C16H16F2N4O3
Mol. Mass.:
350.32
SMILES:
ONC(=O)c1cnc(NC2(CCOCC2)c2cc(F)ccc2F)nc1
: