Target
Histone deacetylase 6
Ligand
BDBM249367
Substrate
Meas. Tech.
HDAC Enzyme Assay
pH
7.4±n/a
Temperature
298.15±n/a K
IC50
3.90±n/a nM
Comments
extracted
Citation
 Mazitschek, Rvan Duzer, JH Pyrimidine hydroxy amide compounds as HDAC6 selective inhibitors US Patent  US9884850 Publication Date 2/6/2018 
Target
Name:
Histone deacetylase 6
Synonyms:
Cereblon/Histone deacetylase 6 HDAC6 Histone deacetylase 6 (HDAC6) KIAA0901 | ORF Names:JM21
Type:
Chromatin regulator; hydrolase; repressor
Mol. Mass.:
131381.51
Organism:
Homo sapiens (Human)
Description:
Q9UBN7
Residue:
1215
  
Inhibitor
Name:
BDBM249367
Synonyms:
US9464073, 004 | US9884850, Compound 4
Type:
Small organic molecule
Emp. Form.:
C19H21FN4O4
Mol. Mass.:
388.3928
SMILES:
ONC(=O)c1cnc(NC2(CCC3(CC2)OCCO3)c2cccc(F)c2)nc1
: