Target
Disintegrin and metalloproteinase domain-containing protein 10
Ligand
BDBM114002
Substrate
Meas. Tech.
Counterscreen for exosite inhibitors of ADAM17: Fluorescence resonance energy transfer (FRET)-based biochemical high throughput dose response assay to identify inhibitors of ADAM10
IC50
69510±n/a nM
Citation
 PubChem, PC Counterscreen for exosite inhibitors of ADAM17: Fluorescence resonance energy transfer (FRET)-based biochemical high throughput dose response assay to identify inhibitors of ADAM10 PubChem Bioassay (2014)[AID] 
Target
Name:
Disintegrin and metalloproteinase domain-containing protein 10
Synonyms:
ADA10_HUMAN Disintegrin and metalloproteinase domain-containing protein 10 (ADAM10) MADM
Type:
Enzyme
Mol. Mass.:
84160.93
Organism:
Homo sapiens (Human)
Description:
O14672
Residue:
748
  
Inhibitor
Name:
BDBM114002
Synonyms:
MLS000519054 N-[3-(2-phenyl-4-thiazolyl)phenyl]-2-thiophenecarboxamide SMR000129474 | cid_3574419
Type:
Small organic molecule
Emp. Form.:
C20H14N2OS2
Mol. Mass.:
362.468
SMILES:
O=C(Nc1cccc(c1)-c1csc(n1)-c1ccccc1)c1cccs1
: