Target
Tyrosyl-DNA phosphodiesterase 2
Ligand
BDBM61215
Substrate
Meas. Tech.
Epi Absorbance-based biochemical high throughput dose response assay to identify inhibitors of human tyrosyl-DNA phosphodiesterase 2 (TDP2)
IC50
26377±n/a nM
Citation
 PubChem, PC Epi Absorbance-based biochemical high throughput dose response assay to identify inhibitors of human tyrosyl-DNA phosphodiesterase 2 (TDP2) PubChem Bioassay (2014)[AID] 
Target
Name:
Tyrosyl-DNA phosphodiesterase 2
Synonyms:
EAP2 ETS1-associated protein 2 TDP2 TTRAP Tyr-DNA phosphodiesterase 2 Tyrosyl-DNA phosphodiesterase 2 (hTDP2) VPg unlinkase | hTDP2
Type:
Enzyme Catalytic Domain
Mol. Mass.:
40916.54
Organism:
Homo sapiens (Human)
Description:
gi_23510348
Residue:
362
  
Inhibitor
Name:
BDBM61215
Synonyms:
(5-amino-1-naphthalenyl)arsonic acid (5-aminonaphthalen-1-yl)arsonic acid MLS000737441 cid_224922
Type:
Small organic molecule
Emp. Form.:
C10H10AsNO3
Mol. Mass.:
267.1129
SMILES:
Nc1cccc2c(cccc12)[As](O)(O)=O
: