Target
Major prion protein
Ligand
BDBM36923
Substrate
Meas. Tech.
TRFRET-based cell-based high throughput dose response assay to identify inhibitors of cell surface Prion Protein (PRPC)
IC50
9140±n/a nM
Citation
 PubChem, PC TRFRET-based cell-based high throughput dose response assay to identify inhibitors of cell surface Prion Protein (PRPC) PubChem Bioassay (2014)[AID] 
Target
Name:
Major prion protein
Synonyms:
ALTPRP CD_antigen=CD230 PRIP PRP PrP33-35C major prion protein preproprotein
Type:
PROTEIN
Mol. Mass.:
27671.97
Organism:
Homo sapiens (Human)
Description:
ChEMBL_158887
Residue:
253
  
Inhibitor
Name:
BDBM36923
Synonyms:
(Z)-3,4-bis(benzenesulfonyl)-2-buten-1-ol (Z)-3,4-bis(phenylsulfonyl)but-2-en-1-ol MLS000080860 cid_5389617
Type:
Small organic molecule
Emp. Form.:
C16H16O5S2
Mol. Mass.:
352.425
SMILES:
OC\C=C(\CS(=O)(=O)c1ccccc1)S(=O)(=O)c1ccccc1
: