Target
Nuclear hormone receptor family member daf-12
Ligand
BDBM49570
Substrate
Meas. Tech.
Luminescence-based cell-based high throughput dose response assay to identify activators of the DAF-12 from the parasite S. stercoralis (ssDAF-12)
IC50
67561±n/a nM
Citation
 PubChem, PC Luminescence-based cell-based high throughput dose response assay to identify activators of the DAF-12 from the parasite S. stercoralis (ssDAF-12) PubChem Bioassay (2013)[AID] 
Target
Name:
Nuclear hormone receptor family member daf-12
Synonyms:
DAF12_CAEEL XL285 daf-20 | mig-7
Type:
Enzyme Catalytic Domain
Mol. Mass.:
84211.49
Organism:
Caenorhabditis elegans
Description:
gi_71987181
Residue:
753
  
Inhibitor
Name:
BDBM49570
Synonyms:
5-(4-chloranyl-2-nitro-phenyl)-3-phenyl-1,2,4-oxadiazole 5-(4-chloro-2-nitrophenyl)-3-phenyl-1,2,4-oxadiazole SMR000198496 | cid_891545
Type:
Small organic molecule
Emp. Form.:
C14H8ClN3O3
Mol. Mass.:
301.685
SMILES:
[O-][N+](=O)c1cc(Cl)ccc1-c1nc(no1)-c1ccccc1
: