Target
Aurora kinase A
Ligand
BDBM116812
Substrate
Meas. Tech.
Enzyme Assay
IC50
0.1±n/a nM
Citation
 Sutton, AELan, RRichardson, TEPerrey, DVandeveer, HGHuck, BRKarra, SRChen, XXiao, YLiu-Bujalski, LGoutopoulos, AStieber, FHodous, BLQiu, HJones, RHeasley, BH Amino azaheterocyclic carboxamides US Patent  US8637532 Publication Date 1/28/2014 
Target
Name:
Aurora kinase A
Synonyms:
AIK ARK-1 AURA AURKA_HUMAN Aurora 2 Aurora kinase A (AURKA) Aurora kinase A (Aurora-2) Aurora/IPL1-related kinase 1 Breast tumor-amplified kinase IAK1 STK15 GN Serine/threonine kinase 15 Serine/threonine-protein kinase 6 Serine/threonine-protein kinase aurora-A aurora-2 | hARK1
Type:
Serine/threonine-protein kinase
Mol. Mass.:
45830.98
Organism:
Homo sapiens (Human)
Description:
O14965
Residue:
403
  
Inhibitor
Name:
BDBM116812
Synonyms:
US8637532, 538
Type:
Small organic molecule
Emp. Form.:
C25H27N7O3
Mol. Mass.:
473.527
SMILES:
NC(=O)c1cccc2c(NC(CCO)c3cccc(NC(O)c4cc(n[nH]4)C4CC4)c3)ncnc12
: