Target
Histone deacetylase 1
Ligand
BDBM117170
Substrate
Meas. Tech.
BIOMOL Fluorescent-Based Assay
pH
7.5±n/a
Temperature
298.15±n/a K
IC50
10±n/a nM
Comments
extracted
Citation
 Lee, KCSun, ETWang, H Imidazo[1,2-a]pyridine derivatives: preparation and pharmaceutical applications US Patent  US8648092 Publication Date 2/11/2014 
Target
Name:
Histone deacetylase 1
Synonyms:
Cereblon/Histone deacetylase 1 HDAC1 Histone deacetylase 1 (HDAC1) RPD3L1
Type:
Enzyme
Mol. Mass.:
55090.27
Organism:
Homo sapiens (Human)
Description:
Q13547
Residue:
482
  
Inhibitor
Name:
BDBM117170
Synonyms:
US8648092, 101
Type:
Small organic molecule
Emp. Form.:
C20H30N4O2
Mol. Mass.:
358.4778
SMILES:
CCC(CC)CN(CC)Cc1c(C)nc2cc(\C=C\C(=O)NO)ccn12
: