Target
P2X purinoceptor 3
Ligand
BDBM118161
Substrate
Meas. Tech.
Binding Assay
IC50
67±n/a nM
Citation
 Wei, ZKincaid, JKelly, MGO'Mahony, DJKaub, C Pyrid-2yl fused heterocyclic compounds, and compositions and uses thereof US Patent  US8653091 Publication Date 2/18/2014 
Target
Name:
P2X purinoceptor 3
Synonyms:
ATP receptor P2RX3 P2X purinoceptor 3 P2X purinoceptor 3 (P2X3) P2X3 purinoceptor p2x3 + hsa
Type:
Protein
Mol. Mass.:
44292.02
Organism:
Homo sapiens (Human)
Description:
P56373
Residue:
397
  
Inhibitor
Name:
BDBM118161
Synonyms:
US8653091, 56
Type:
Small organic molecule
Emp. Form.:
C22H23F3N6O
Mol. Mass.:
444.4528
SMILES:
Cc1ccc(nc1)N1CCc2ncnc(NC(CCO)c3ccc(nc3)C(F)(F)F)c2C1
: