Target
UDP-N-acetylmuramate--L-alanine ligase
Ligand
BDBM119086
Substrate
IC50
3.0e+4±n/a nM
Citation
 Hrast, MSosic, ISink, RGobec, S Inhibitors of the peptidoglycan biosynthesis enzymes MurA-F. Bioorg Chem 55:2-15 (2014)  
Target
Name:
UDP-N-acetylmuramate--L-alanine ligase
Synonyms:
MURC_ECOLI UDP-N-acetylmuramate--L-alanine ligase | murC
Type:
Protein
Mol. Mass.:
53617.78
Organism:
Escherichia coli
Description:
P17952
Residue:
491
  
Inhibitor
Name:
BDBM119086
Synonyms:
MurC/D inhibitor (compound 25) | MurD inhibitor (compound 35)
Type:
Small organic molecule
Emp. Form.:
C24H18BrN3O3S
Mol. Mass.:
508.387
SMILES:
Brc1cccc(c1)C(=O)Nc1ccc(C=NNS(=O)(=O)c2ccc3ccccc3c2)cc1
: