Target
Macrophage metalloelastase
Ligand
BDBM120191
Substrate
Meas. Tech.
Inhibition Assay
Ki
2.2±n/a nM
Citation
 Devel, LBeau, FCzarny, BDive, V Pseudodipeptides as MMP inhibitors US Patent  US8691753 Publication Date 4/8/2014 
Target
Name:
Macrophage metalloelastase
Synonyms:
HME MMP12_HUMAN Matrix metalloproteinase-12 (MMP 12) Matrix metalloproteinase-12 (MMP12) | Matrix metalloproteinases 12 (MMP-12)
Type:
Enzyme
Mol. Mass.:
54012.99
Organism:
Homo sapiens (Human)
Description:
P39900
Residue:
470
  
Inhibitor
Name:
BDBM120191
Synonyms:
US8691753, 39
Type:
Small organic molecule
Emp. Form.:
C25H28N4O5S
Mol. Mass.:
496.579
SMILES:
CC[C@H](NC(=O)CCc1ccc(cc1)-c1nc2ccccc2s1)C(=O)N[C@@H](CCC(O)=O)C(N)=O
: