Target
Macrophage colony-stimulating factor 1 receptor
Ligand
BDBM50381716
Substrate
Meas. Tech.
Homogenous Time-Resolved Fluorescence Assay (HTRF)
pH
7.1±n/a
Temperature
298.15±n/a K
IC50
2.22±n/a nM
Comments
extracted
Citation
 Michaelides, MRFrey, RCurtin, M Thieno[3,2-C]pyridine kinase inhibitors with improved CYP safety profile US Patent  US8722890 Publication Date 5/13/2014 
Target
Name:
Macrophage colony-stimulating factor 1 receptor
Synonyms:
CSF1R FMS Macrophage colony stimulating factor receptor Macrophage colony-stimulating factor 1 receptor (c-FMS) Proto-oncogene c-Fms c-fms | cFMS
Type:
Protein
Mol. Mass.:
107979.48
Organism:
Homo sapiens (Human)
Description:
P07333
Residue:
972
  
Inhibitor
Name:
BDBM50381716
Synonyms:
ABT-348 US8722890, 1 | US8722890, 2
Type:
Small organic molecule
Emp. Form.:
C25H21FN6O2S
Mol. Mass.:
488.537
SMILES:
Nc1ncc(-c2cnn(CCO)c2)c2scc(-c3ccc(NC(=O)Nc4cccc(F)c4)cc3)c12
: