Target
Macrophage colony-stimulating factor 1 receptor
Ligand
BDBM121389
Substrate
Meas. Tech.
Homogenous Time-Resolved Fluorescence Assay (HTRF)
pH
7.1±n/a
Temperature
298.15±n/a K
IC50
7.87±n/a nM
Comments
extracted
Citation
 Michaelides, MRFrey, RCurtin, M Thieno[3,2-C]pyridine kinase inhibitors with improved CYP safety profile US Patent  US8722890 Publication Date 5/13/2014 
Target
Name:
Macrophage colony-stimulating factor 1 receptor
Synonyms:
CSF1R FMS Macrophage colony stimulating factor receptor Macrophage colony-stimulating factor 1 receptor (c-FMS) Proto-oncogene c-Fms c-fms | cFMS
Type:
Protein
Mol. Mass.:
107979.48
Organism:
Homo sapiens (Human)
Description:
P07333
Residue:
972
  
Inhibitor
Name:
BDBM121389
Synonyms:
US8722890, 4
Type:
Small organic molecule
Emp. Form.:
C28H28N6O3S
Mol. Mass.:
528.625
SMILES:
COc1ccc(NC(=O)Nc2ccc(cc2)-c2csc3c(cnc(N)c23)-c2cnn(CC(C)(C)O)c2)cc1
: