Target
Macrophage colony-stimulating factor 1 receptor
Ligand
BDBM50381698
Substrate
Meas. Tech.
Homogenous Time-Resolved Fluorescence Assay (HTRF)
pH
7.1±n/a
Temperature
298.15±n/a K
IC50
2.74±n/a nM
Comments
extracted
Citation
 Michaelides, MRFrey, RCurtin, M Thieno[3,2-C]pyridine kinase inhibitors with improved CYP safety profile US Patent  US8722890 Publication Date 5/13/2014 
Target
Name:
Macrophage colony-stimulating factor 1 receptor
Synonyms:
CSF1R FMS Macrophage colony stimulating factor receptor Macrophage colony-stimulating factor 1 receptor (c-FMS) Proto-oncogene c-Fms c-fms | cFMS
Type:
Protein
Mol. Mass.:
107979.48
Organism:
Homo sapiens (Human)
Description:
P07333
Residue:
972
  
Inhibitor
Name:
BDBM50381698
Synonyms:
CHEMBL1969102 | US8722890, 6
Type:
Small organic molecule
Emp. Form.:
C24H20N6OS
Mol. Mass.:
440.52
SMILES:
Cc1cccc(NC(=O)Nc2ccc(cc2)-c2csc3c(cnc(N)c23)-c2cn[nH]c2)c1
: