Target
Macrophage colony-stimulating factor 1 receptor
Ligand
BDBM121396
Substrate
Meas. Tech.
Fluorescence Polarization Competition Immunoassay
pH
7.5±n/a
IC50
3.4±n/a nM
Comments
extracted
Citation
 Illig, CRChen, JDesJarlais, RLWilson, K Inhibitors of C-FMS kinase US Patent  US8722718 Publication Date 5/13/2014 
Target
Name:
Macrophage colony-stimulating factor 1 receptor
Synonyms:
CSF1R_MOUSE Csfmr Macrophage colony-stimulating factor 1 receptor Proto-oncogene c-Fms
Type:
Protein
Mol. Mass.:
109173.45
Organism:
Mus musculus (Mouse)
Description:
P09581
Residue:
977
  
Inhibitor
Name:
BDBM121396
Synonyms:
US8722718, 1
Type:
Small organic molecule
Emp. Form.:
C21H22N4O3
Mol. Mass.:
378.4244
SMILES:
CC1(OCCO1)c1ccc(NC(=O)c2ncc([nH]2)C#N)c(c1)C1=CCCCC1
: